{"text_format":"1","workbook":"xlsx","n_sheets":4,"sheets":["出品目録","作品目録①～⑤","氏名７文字変換シート","カタカナ⇒ひらがな"],"not_rendered":{"charts":0,"images":7,"macros":1,"external_links":0,"defined_names":2,"comments":2,"pivot_tables":0},"unopened":[],"bounds":{"document_bytes":16777216,"sheet_cells":100000,"rows_first":2000,"rows_last":500,"rows_between":2000,"halvings":0,"cell_chars":16384,"cell_head_chars":4096},"cells_cut":0,"cells_raw":0,"read":"whole","date_system":"1900"}

{"sheet":"出品目録","index":0,"n_rows":136,"n_cols":51,"rows_kept":136,"cut":false,"hidden":false,"merged":[[15,3,15,5],[16,3,16,5],[2,2,2,6],[4,9,4,11],[5,7,5,8],[4,7,4,8],[3,7,3,8],[13,1,13,3],[5,2,5,5],[3,2,4,5],[18,24,18,33],[0,1,0,11],[1,1,1,11],[14,10,14,11],[11,1,11,11],[13,5,13,6],[12,5,12,6],[7,7,7,8],[8,7,8,8],[12,1,12,3],[8,10,8,11],[7,10,7,11],[2,7,2,8],[5,23,5,32],[3,9,3,11],[2,9,2,11],[2,23,2,32],[3,23,3,32],[4,23,4,32],[20,0,20,12],[21,0,21,12],[19,1,19,11],[3,1,5,1],[16,7,16,8],[6,2,6,9],[7,1,8,2],[9,1,10,2],[9,7,9,8],[10,7,10,8],[9,10,9,11],[10,10,10,11],[5,9,5,11],[9,13,9,19],[6,13,6,17],[15,9,16,10],[15,11,16,11],[18,1,18,11],[15,7,15,8],[8,14,8,21],[17,1,17,11],[10,5,10,6],[9,5,9,6],[7,5,7,6],[14,1,14,3],[8,5,8,6],[15,1,15,2],[10,13,10,20],[16,1,16,2]]}
[null,"第46回岩手県高等学校総合文化祭書道部門・第58回岩手県高等学校書道展",null,null,null,null,null,null,null,null,null,null,null,null,null,null,null,null,null,null,null,null,null,null,null,null,null,null,null,null,null,null,null,null,null,"きづや西林堂",null,null,null,null,null,null,null,null,null,null,null,null,null,null,"きづや西林堂"]
[null,"出　品　目　録",null,null,null,null,null,null,null,null,null,null,null,null,null,null,null,null,null,null,null,null,null,null,null,null,null,null,null,null,null,null,null,null,null,"赤帽吉田サービス",null,null,null,null,null,null,null,null,null,null,null,null,null,null,"赤帽吉田サービス"]
[null,"学校番号","学校名 ※一覧にない場合は直接入力",null,null,null,null,"学校電話番号"]
[null,null,{"$f":"IF(B4=\"\",\"\",VLOOKUP(B4,$Z$30:$AA$159,2,FALSE))","v":""},null,null,null,null,"学校FAX番号",null,null,null,null,null,null,null,"のセルに入力してください。"]
[null,null,null,null,null,null,null,"出品担当者名",null,null,null,null,null,null,null,"のセルは入力不要です。"]
[null,null,{"$f":"IF(OR(B4=17,B4=18,B4=19,B4=20,B4=21,B4=22,B4=33,B4=41,B4=57,B4=64,B4=68,B4=76,B4=81,B4=91,B4=98),\"学校\",\"高等学校\")","v":"高等学校"},null,null,null,null,"担当者携帯電話"]
[null,"学校住所",{"$f":"IF(O8=\"\",\"\",CONCATENATE(N8,O8,P8,Q8,\" \",O9))","v":""},null,null,null,null,null,null,null,null,null,null,"【学校住所】入力欄"]
[null,"搬入：11月14日(火)",null,null,"委　　託","（業者名）",null,null,null,"電話番号",null,null,null,"　〒",null,"-"]
[null,null,null,null,"直接搬入","（担当者名）",null,null,null,"携帯電話番号",null,null,null,"住所"]
[null,"搬出：11月21日(火)",null,null,"委　　託","（業者名）",null,null,null,"電話番号",null,null,null,"きづや西林堂 ： 019-623-3341"]
[null,null,null,null,"直接搬出","（担当者名）",null,null,null,"携帯電話番号",null,null,null,"赤帽吉田サービス ： 019-635-5672"]
[null,"【 出 品 状 況 】"]
[null,"漢字・仮名",null,null,"部門","全紙",null,{"$f":"COUNTA('作品目録①～⑤'!F14:F113)","v":0},"点","半切",{"$f":"COUNTA('作品目録①～⑤'!F122:F221)","v":0},"点"]
[null,"漢字仮名交じり",null,null,"部門","全紙",null,{"$f":"COUNTA('作品目録①～⑤'!AD14:AD113)","v":0},"点","半切",{"$f":"COUNTA('作品目録①～⑤'!AD122:AD221)","v":0},"点"]
[null,"篆刻",null,null,"部門",null,null,{"$f":"COUNTA('作品目録①～⑤'!F229:F328)","v":0},"点"]
[null,"出品総数",null,{"$f":"SUM(H13,K13,H14,K14,H15)","v":0},null,null,"点","参加料",null,{"$f":"IF(H13+K13+H14+K14+H15=0,\"\",D16*400)","v":""},null,"円"]
[null,"参加者数",null,{"$f":"'作品目録①～⑤'!BZ517","v":0},null,null,"名","出品総数×400円"]
[null,"※　郵便振込み口座 ： 02290−3−113262　岩手県高等学校文化連盟　書道専門部　振込締切：令和５年10月16日（月）"]
[null,"出品目録提出 締切：令和５年10月４日(水) 17:00（締切時間厳守）"]
[null,"送信先：北上翔南高校（担当：福井豊 ptf15-fukui-yutaka@iwate-ed.jp)"]
{"$rows_left_out":117}
{"sheet":"作品目録①～⑤","index":1,"n_rows":517,"n_cols":79,"rows_kept":517,"cut":false,"hidden":false,"merged":[[8,1,12,1],[8,25,12,25],[116,1,120,1],[116,25,120,25],[225,1,227,1],[9,43,11,43],[11,19,11,20],[12,19,12,20],[13,19,13,20],[14,19,14,20],[15,19,15,20],[16,19,16,20],[17,19,17,20],[18,19,18,20],[19,19,19,20],[20,19,20,20],[32,19,32,20],[45,19,45,20],[46,19,46,20],[47,19,47,20],[48,19,48,20],[49,19,49,20],[50,19,50,20],[39,19,39,20],[117,44,119,44],[123,20,123,21],[124,20,124,21],[125,20,125,21],[225,4,225,8],[224,4,224,8],[21,19,21,20],[22,19,22,20],[23,19,23,20],[24,19,24,20],[25,19,25,20],[26,19,26,20],[33,19,33,20],[34,19,34,20],[35,19,35,20],[36,19,36,20],[37,19,37,20],[38,19,38,20],[27,19,27,20],[28,19,28,20],[29,19,29,20],[30,19,30,20],[31,19,31,20],[40,19,40,20],[41,19,41,20],[42,19,42,20],[43,19,43,20],[44,19,44,20],[57,19,57,20],[58,19,58,20],[59,19,59,20],[60,19,60,20],[61,19,61,20],[62,19,62,20],[51,19,51,20],[52,19,52,20],[53,19,53,20],[54,19,54,20],[55,19,55,20],[56,19,56,20],[69,19,69,20],[70,19,70,20],[71,19,71,20],[72,19,72,20],[73,19,73,20],[74,19,74,20],[63,19,63,20],[64,19,64,20],[65,19,65,20],[66,19,66,20],[67,19,67,20],[68,19,68,20],[81,19,81,20],[82,19,82,20],[83,19,83,20],[84,19,84,20],[85,19,85,20],[86,19,86,20],[75,19,75,20],[76,19,76,20],[77,19,77,20],[78,19,78,20],[79,19,79,20],[80,19,80,20],[93,19,93,20],[94,19,94,20],[95,19,95,20],[96,19,96,20],[97,19,97,20],[98,19,98,20],[87,19,87,20],[88,19,88,20],[89,19,89,20],[90,19,90,20],[91,19,91,20],[92,19,92,20],[105,19,105,20],[106,19,106,20],[107,19,107,20],[108,19,108,20],[109,19,109,20],[110,19,110,20],[99,19,99,20],[100,19,100,20],[101,19,101,20],[102,19,102,20],[103,19,103,20],[104,19,104,20],[126,20,126,21],[127,20,127,21],[128,20,128,21],[129,20,129,21],[130,20,130,21],[131,20,131,21],[111,19,111,20],[112,19,112,20],[119,20,119,21],[120,20,120,21],[121,20,121,21],[122,20,122,21],[138,20,138,21],[139,20,139,21],[140,20,140,21],[141,20,141,21],[142,20,142,21],[143,20,143,21],[132,20,132,21],[133,20,133,21],[134,20,134,21],[135,20,135,21],[136,20,136,21],[137,20,137,21],[150,20,150,21],[151,20,151,21],[152,20,152,21],[153,20,153,21],[154,20,154,21],[155,20,155,21],[144,20,144,21],[145,20,145,21],[146,20,146,21],[147,20,147,21],[148,20,148,21],[149,20,149,21],[162,20,162,21],[163,20,163,21],[164,20,164,21],[165,20,165,21],[166,20,166,21],[167,20,167,21],[156,20,156,21],[157,20,157,21],[158,20,158,21],[159,20,159,21],[160,20,160,21],[161,20,161,21],[174,20,174,21],[175,20,175,21],[176,20,176,21],[177,20,177,21],[178,20,178,21],[179,20,179,21],[168,20,168,21],[169,20,169,21],[170,20,170,21],[171,20,171,21],[172,20,172,21],[173,20,173,21],[186,20,186,21],[187,20,187,21],[188,20,188,21],[189,20,189,21],[190,20,190,21],[191,20,191,21],[180,20,180,21],[181,20,181,21],[182,20,182,21],[183,20,183,21],[184,20,184,21],[185,20,185,21],[199,20,199,21],[200,20,200,21],[201,20,201,21],[202,20,202,21],[203,20,203,21],[192,20,192,21],[193,20,193,21],[194,20,194,21],[195,20,195,21],[196,20,196,21],[197,20,197,21],[323,16,323,19],[324,16,324,19],[325,16,325,19],[326,16,326,19],[327,16,327,19],[114,25,114,28],[245,16,245,19],[246,16,246,19],[247,16,247,19],[248,16,248,19],[249,16,249,19],[250,16,250,19],[251,16,251,19],[252,16,252,19],[253,16,253,19],[254,16,254,19],[255,16,255,19],[256,16,256,19],[233,16,233,19],[234,16,234,19],[235,16,235,19],[236,16,236,19],[237,16,237,19],[257,16,257,19],[11,44,11,45],[12,44,12,45],[13,44,13,45],[14,44,14,45],[15,44,15,45],[16,44,16,45],[320,16,320,19],[321,16,321,19],[322,16,322,19],[238,16,238,19],[239,16,239,19],[240,16,240,19],[241,16,241,19],[242,16,242,19],[243,16,243,19],[244,16,244,19],[216,20,216,21],[217,20,217,21],[218,20,218,21],[219,20,219,21],[220,20,220,21],[232,16,232,19],[210,20,210,21],[211,20,211,21],[23,44,23,45],[24,44,24,45],[25,44,25,45],[26,44,26,45],[27,44,27,45],[28,44,28,45],[17,44,17,45],[18,44,18,45],[19,44,19,45],[20,44,20,45],[21,44,21,45],[22,44,22,45],[35,44,35,45],[36,44,36,45],[37,44,37,45],[38,44,38,45],[39,44,39,45],[40,44,40,45],[29,44,29,45],[30,44,30,45],[31,44,31,45],[32,44,32,45],[33,44,33,45],[34,44,34,45],[47,44,47,45],[48,44,48,45],[49,44,49,45],[50,44,50,45],[51,44,51,45],[52,44,52,45],[41,44,41,45],[42,44,42,45],[43,44,43,45],[44,44,44,45],[45,44,45,45],[46,44,46,45],[59,44,59,45],[60,44,60,45],[61,44,61,45],[62,44,62,45],[63,44,63,45],[64,44,64,45],[53,44,53,45],[54,44,54,45],[55,44,55,45],[56,44,56,45],[57,44,57,45],[58,44,58,45],[71,44,71,45],[72,44,72,45],[73,44,73,45],[74,44,74,45],[75,44,75,45],[76,44,76,45],[65,44,65,45],[66,44,66,45],[67,44,67,45],[68,44,68,45],[69,44,69,45],[70,44,70,45],[83,44,83,45],[84,44,84,45],[85,44,85,45],[86,44,86,45],[87,44,87,45],[88,44,88,45],[77,44,77,45],[78,44,78,45],[79,44,79,45],[80,44,80,45],[81,44,81,45],[82,44,82,45],[95,44,95,45],[96,44,96,45],[97,44,97,45],[98,44,98,45],[99,44,99,45],[100,44,100,45],[89,44,89,45],[90,44,90,45],[91,44,91,45],[92,44,92,45],[93,44,93,45],[94,44,94,45],[223,1,223,6],[107,44,107,45],[108,44,108,45],[109,44,109,45],[110,44,110,45],[111,44,111,45],[112,44,112,45],[101,44,101,45],[102,44,102,45],[103,44,103,45],[104,44,104,45],[105,44,105,45],[106,44,106,45],[212,20,212,21],[213,20,213,21],[214,20,214,21],[215,20,215,21],[204,20,204,21],[205,20,205,21],[206,20,206,21],[207,20,207,21],[208,20,208,21],[209,20,209,21],[198,20,198,21],[119,45,119,46],[120,45,120,46],[121,45,121,46],[122,45,122,46],[123,45,123,46],[124,45,124,46],[125,45,125,46],[126,45,126,46],[127,45,127,46],[128,45,128,46],[129,45,129,46],[130,45,130,46],[131,45,131,46],[132,45,132,46],[133,45,133,46],[134,45,134,46],[135,45,135,46],[136,45,136,46],[137,45,137,46],[138,45,138,46],[139,45,139,46],[140,45,140,46],[141,45,141,46],[142,45,142,46],[143,45,143,46],[144,45,144,46],[145,45,145,46],[146,45,146,46],[147,45,147,46],[148,45,148,46],[149,45,149,46],[150,45,150,46],[151,45,151,46],[152,45,152,46],[153,45,153,46],[154,45,154,46],[155,45,155,46],[156,45,156,46],[157,45,157,46],[158,45,158,46],[159,45,159,46],[160,45,160,46],[161,45,161,46],[162,45,162,46],[163,45,163,46],[164,45,164,46],[165,45,165,46],[166,45,166,46],[167,45,167,46],[168,45,168,46],[169,45,169,46],[170,45,170,46],[171,45,171,46],[172,45,172,46],[173,45,173,46],[174,45,174,46],[175,45,175,46],[176,45,176,46],[177,45,177,46],[178,45,178,46],[179,45,179,46],[180,45,180,46],[181,45,181,46],[182,45,182,46],[183,45,183,46],[184,45,184,46],[185,45,185,46],[186,45,186,46],[187,45,187,46],[188,45,188,46],[189,45,189,46],[190,45,190,46],[191,45,191,46],[192,45,192,46],[193,45,193,46],[194,45,194,46],[195,45,195,46],[196,45,196,46],[197,45,197,46],[198,45,198,46],[199,45,199,46],[200,45,200,46],[201,45,201,46],[202,45,202,46],[203,45,203,46],[204,45,204,46],[205,45,205,46],[206,45,206,46],[207,45,207,46],[208,45,208,46],[209,45,209,46],[210,45,210,46],[211,45,211,46],[212,45,212,46],[213,45,213,46],[214,45,214,46],[215,45,215,46],[216,45,216,46],[217,45,217,46],[218,45,218,46],[219,45,219,46],[220,45,220,46],[226,16,226,19],[227,16,227,19],[228,16,228,19],[229,16,229,19],[230,16,230,19],[231,16,231,19],[258,16,258,19],[259,16,259,19],[260,16,260,19],[261,16,261,19],[262,16,262,19],[263,16,263,19],[264,16,264,19],[265,16,265,19],[266,16,266,19],[267,16,267,19],[268,16,268,19],[269,16,269,19],[270,16,270,19],[271,16,271,19],[272,16,272,19],[273,16,273,19],[274,16,274,19],[275,16,275,19],[291,16,291,19],[292,16,292,19],[293,16,293,19],[276,16,276,19],[277,16,277,19],[278,16,278,19],[279,16,279,19],[280,16,280,19],[281,16,281,19],[282,16,282,19],[283,16,283,19],[284,16,284,19],[313,16,313,19],[314,16,314,19],[315,16,315,19],[316,16,316,19],[317,16,317,19],[318,16,318,19],[319,16,319,19],[303,16,303,19],[304,16,304,19],[305,16,305,19],[306,16,306,19],[307,16,307,19],[308,16,308,19],[309,16,309,19],[310,16,310,19],[311,16,311,19],[136,47,136,52],[137,47,137,52],[25,46,25,51],[24,46,24,51],[23,46,23,51],[134,47,134,52],[135,47,135,52],[22,46,22,51],[312,16,312,19],[294,16,294,19],[295,16,295,19],[296,16,296,19],[297,16,297,19],[298,16,298,19],[299,16,299,19],[300,16,300,19],[301,16,301,19],[302,16,302,19],[285,16,285,19],[286,16,286,19],[287,16,287,19],[288,16,288,19],[289,16,289,19],[290,16,290,19]]}
[null,null,"★　データ入力　：　学校番号・学年・氏名（全角７文字分に割り付ける。半角スペースは使用しないこと）"]
[null,null,null,null,null,"　ふりがな・形式(縦・横・正方形の項目に「1」）・種別（A・B・C・D）・作品題名"]
[null,null,null,null,null,null,"種別 ： 第１種（全紙：Ａ 70㎝×136㎝　連落：Ｂ 53㎝×136㎝）　　第２種（半切：Ｃ 35㎝×136㎝　正方形：Ｄ 70㎝×70㎝）　　第３種（篆刻）"]
[null,null,"★　漢字仮名交じりの著作権には 【手続き済み：○　手続き不要：×　「日本文藝作家協会」に許諾申請希望：☆ 】 を記入（要項参照）"]
[]
[]
[null,"作品目録 ①",null,null,null,null,null,null,null,null,null,null,null,null,null,null,null,null,null,null,null,null,null,null,null,"作品目録 ②"]
[null,null,null,null,"第１種：全紙",null,null,null,null,null,null,null,null,null,null,null,null,null,null,null,null,null,null,null,null,null,null,null,"第１種：全紙"]
[null,"※未記入",null,null,"漢字・かな",null,null,null,null,null,null,null,null,null,null,null,null,null,null,null,null,null,null,null,null,"※未記入",null,null,"漢字仮名交じり"]
[null,null,null,null,"  種別　Ａ：全紙　Ｂ：聯落",null,null,null,null,null,null,null,null,null,null,null,null,null,null,null,null,null,null,null,null,null,null,null,"　種別　Ａ：全紙　Ｂ：聯落",null,null,null,null,null,null,null,null,null,null,null,null,null,null,"著作権"]
[null,null,null,null,"  形式　「１」を入力",null,null,null,null,null,null,null,null,null,null,null,null,null,null,null,null,null,null,null,null,null,null,null,"　形式　「１」を入力"]
[null,null,null,null,"整理番号","学校番号","学校名","学年","氏　　　　名","ふりがな",null,null,null,null,null,null,"縦","横","種別","\n\n作品題名",null,null,null,null,null,null,null,null,"整理番号","学校番号","学校名","学年","氏　　　　名","ふりがな",null,null,null,null,null,null,"縦","横","種別",null,"\n作品題名\n※必ず詩文の作者名\nを入れること"]
[null,null,null,null,"例",1,"盛岡第一",3,"盛　岡　　　城","もりおか　じょう",1,2,3,4,5,6,null,1,"B","臨風信帖",null,null,null,null,null,null,null,null,"例",1,"盛岡第一",2,"岩　手　もり子","いわて　もりこ",1,2,3,4,5,6,1,null,"A","×","北原白秋「真珠抄」より"]
[null,null,"１種","漢・仮",1,null,{"$f":"IF(F14>0,VLOOKUP(F14,出品目録!$Z$29:$AA$144,2),\"\")","v":""},null,null,null,null,null,null,null,null,null,null,null,null,null,null,null,null,null,null,null,"１種","交じり",1,null,{"$f":"IF(AD14>0,VLOOKUP(AD14,出品目録!$Z$29:$AA$144,2),\"\")","v":""},null,null,null,null,null,null,null,null,null,null,null,null,null,null,null,null,null,null,null,null,null,null,null,null,null,null,null,null,null,null,null,null,null,null,null,null,null,null,null,null,null,null,null,null,null,null,{"$f":"COUNTIF($CA$14:$CA$513,CA14)","v":500},{"$f":"IF(I14=\"\",\"\",I14)","v":""}]
[null,null,"１種","漢・仮",2,null,{"$f":"IF(F15>0,VLOOKUP(F15,出品目録!$Z$29:$AA$144,2),\"\")","v":""},null,null,null,null,null,null,null,null,null,null,null,null,null,null,null,null,null,null,null,"１種","交じり",2,null,{"$f":"IF(AD15>0,VLOOKUP(AD15,出品目録!$Z$29:$AA$144,2),\"\")","v":""},null,null,null,null,null,null,null,null,null,null,null,null,null,null,null,null,null,null,null,null,null,null,null,null,null,null,null,null,null,null,null,null,null,null,null,null,null,null,null,null,null,null,null,null,null,null,{"$f":"COUNTIF($CA$14:$CA$513,CA15)","v":500},{"$f":"IF(I15=\"\",\"\",I15)","v":""}]
[null,null,"１種","漢・仮",3,null,{"$f":"IF(F16>0,VLOOKUP(F16,出品目録!$Z$29:$AA$144,2),\"\")","v":""},null,null,null,null,null,null,null,null,null,null,null,null,null,null,null,null,null,null,null,"１種","交じり",3,null,{"$f":"IF(AD16>0,VLOOKUP(AD16,出品目録!$Z$29:$AA$144,2),\"\")","v":""},null,null,null,null,null,null,null,null,null,null,null,null,null,null,null,null,null,null,null,null,null,null,null,null,null,null,null,null,null,null,null,null,null,null,null,null,null,null,null,null,null,null,null,null,null,null,500,""]
[null,null,"１種","漢・仮",4,null,{"$f":"IF(F17>0,VLOOKUP(F17,出品目録!$Z$29:$AA$144,2),\"\")","v":""},null,null,null,null,null,null,null,null,null,null,null,null,null,null,null,null,null,null,null,"１種","交じり",4,null,{"$f":"IF(AD17>0,VLOOKUP(AD17,出品目録!$Z$29:$AA$144,2),\"\")","v":""},null,null,null,null,null,null,null,null,null,null,null,null,null,null,null,null,null,null,null,null,null,null,null,null,null,null,null,null,null,null,null,null,null,null,null,null,null,null,null,null,null,null,null,null,null,null,500,""]
[null,null,"１種","漢・仮",5,null,{"$f":"IF(F18>0,VLOOKUP(F18,出品目録!$Z$29:$AA$144,2),\"\")","v":""},null,null,null,null,null,null,null,null,null,null,null,null,null,null,null,null,null,null,null,"１種","交じり",5,null,{"$f":"IF(AD18>0,VLOOKUP(AD18,出品目録!$Z$29:$AA$144,2),\"\")","v":""},null,null,null,null,null,null,null,null,null,null,null,null,null,null,null,null,null,null,null,null,null,null,null,null,null,null,null,null,null,null,null,null,null,null,null,null,null,null,null,null,null,null,null,null,null,null,500,""]
[null,null,"１種","漢・仮",6,null,{"$f":"IF(F19>0,VLOOKUP(F19,出品目録!$Z$29:$AA$144,2),\"\")","v":""},null,null,null,null,null,null,null,null,null,null,null,null,null,null,null,null,null,null,null,"１種","交じり",6,null,{"$f":"IF(AD19>0,VLOOKUP(AD19,出品目録!$Z$29:$AA$144,2),\"\")","v":""},null,null,null,null,null,null,null,null,null,null,null,null,null,null,null,null,null,null,null,null,null,null,null,null,null,null,null,null,null,null,null,null,null,null,null,null,null,null,null,null,null,null,null,null,null,null,500,""]
[null,null,"１種","漢・仮",7,null,{"$f":"IF(F20>0,VLOOKUP(F20,出品目録!$Z$29:$AA$144,2),\"\")","v":""},null,null,null,null,null,null,null,null,null,null,null,null,null,null,null,null,null,null,null,"１種","交じり",7,null,{"$f":"IF(AD20>0,VLOOKUP(AD20,出品目録!$Z$29:$AA$144,2),\"\")","v":""},null,null,null,null,null,null,null,null,null,null,null,null,null,null,null,null,null,null,null,null,null,null,null,null,null,null,null,null,null,null,null,null,null,null,null,null,null,null,null,null,null,null,null,null,null,null,500,""]
{"$rows_left_out":498}
{"sheet":"氏名７文字変換シート","index":2,"n_rows":150,"n_cols":7,"rows_kept":150,"cut":false,"hidden":false,"merged":[]}
[null,"氏名","名字","名前","名字","名前","７文字変換"]
[null,"盛岡　城",{"$f":"MID($B2,1,SEARCH(\"　\",$B2)-1)","v":"盛岡"},{"$f":"MID($B2,SEARCH(\"　\",$B2)+1,100)","v":"城"},{"$f":"CHOOSE(LEN(C2),C2&\"　　\",MID(C2,1,1)&\"　\"&MID(C2,2,1),C2)","v":"盛　岡"},{"$f":"CHOOSE(LEN(D2),\"　　\"&D2,MID(D2,1,1)&\"　\"&MID(D2,2,1),D2)","v":"　　城"},{"$f":"IF(OR(LEN(C2)>3,LEN(D2)>3),B2,E2&\"　\"&F2)","v":"盛　岡　　　城"}]
[null,"盛　一郎",{"$f":"MID($B3,1,SEARCH(\"　\",$B3)-1)","v":"盛"},{"$f":"MID($B3,SEARCH(\"　\",$B3)+1,100)","v":"一郎"},{"$f":"CHOOSE(LEN(C3),C3&\"　　\",MID(C3,1,1)&\"　\"&MID(C3,2,1),C3)","v":"盛　　"},{"$f":"CHOOSE(LEN(D3),\"　　\"&D3,MID(D3,1,1)&\"　\"&MID(D3,2,1),D3)","v":"一　郎"},{"$f":"IF(OR(LEN(C3)>3,LEN(D3)>3),B3,E3&\"　\"&F3)","v":"盛　　　一　郎"}]
[null,null,{"$error":"#VALUE!"},{"$error":"#VALUE!"},{"$error":"#VALUE!"},{"$error":"#VALUE!"},{"$error":"#VALUE!"}]
[null,null,{"$error":"#VALUE!"},{"$error":"#VALUE!"},{"$error":"#VALUE!"},{"$error":"#VALUE!"},{"$error":"#VALUE!"}]
[null,null,{"$error":"#VALUE!"},{"$error":"#VALUE!"},{"$error":"#VALUE!"},{"$error":"#VALUE!"},{"$error":"#VALUE!"}]
[null,null,{"$error":"#VALUE!"},{"$error":"#VALUE!"},{"$error":"#VALUE!"},{"$error":"#VALUE!"},{"$error":"#VALUE!"}]
[null,null,{"$error":"#VALUE!"},{"$error":"#VALUE!"},{"$error":"#VALUE!"},{"$error":"#VALUE!"},{"$error":"#VALUE!"}]
[null,null,{"$error":"#VALUE!"},{"$error":"#VALUE!"},{"$error":"#VALUE!"},{"$error":"#VALUE!"},{"$error":"#VALUE!"}]
[null,null,{"$error":"#VALUE!"},{"$error":"#VALUE!"},{"$error":"#VALUE!"},{"$error":"#VALUE!"},{"$error":"#VALUE!"}]
[null,null,{"$error":"#VALUE!"},{"$error":"#VALUE!"},{"$error":"#VALUE!"},{"$error":"#VALUE!"},{"$error":"#VALUE!"}]
[null,null,{"$error":"#VALUE!"},{"$error":"#VALUE!"},{"$error":"#VALUE!"},{"$error":"#VALUE!"},{"$error":"#VALUE!"}]
[null,null,{"$error":"#VALUE!"},{"$error":"#VALUE!"},{"$error":"#VALUE!"},{"$error":"#VALUE!"},{"$error":"#VALUE!"}]
[null,null,{"$error":"#VALUE!"},{"$error":"#VALUE!"},{"$error":"#VALUE!"},{"$error":"#VALUE!"},{"$error":"#VALUE!"}]
[null,null,{"$error":"#VALUE!"},{"$error":"#VALUE!"},{"$f":"CHOOSE(LEN(C15),C15&\"　　\",MID(C15,1,1)&\"　\"&MID(C15,2,1),C15)","v":{"$error":"#VALUE!"}},{"$error":"#VALUE!"},{"$error":"#VALUE!"}]
[null,null,{"$error":"#VALUE!"},{"$error":"#VALUE!"},{"$error":"#VALUE!"},{"$error":"#VALUE!"},{"$error":"#VALUE!"}]
[null,null,{"$error":"#VALUE!"},{"$error":"#VALUE!"},{"$error":"#VALUE!"},{"$error":"#VALUE!"},{"$error":"#VALUE!"}]
[null,null,{"$error":"#VALUE!"},{"$error":"#VALUE!"},{"$error":"#VALUE!"},{"$error":"#VALUE!"},{"$error":"#VALUE!"}]
[null,null,{"$error":"#VALUE!"},{"$error":"#VALUE!"},{"$error":"#VALUE!"},{"$error":"#VALUE!"},{"$error":"#VALUE!"}]
[null,null,{"$error":"#VALUE!"},{"$error":"#VALUE!"},{"$error":"#VALUE!"},{"$error":"#VALUE!"},{"$error":"#VALUE!"}]
{"$rows_left_out":131}
{"sheet":"カタカナ⇒ひらがな","index":3,"n_rows":150,"n_cols":7,"rows_kept":150,"cut":false,"hidden":false,"merged":[]}
[null,"カタカナ","名字","名前","名字","名前","ひらがな"]
[null,"モリオカ　ジョウ",{"$f":"MID($B2,1,SEARCH(\"　\",$B2)-1)","v":"モリオカ"},{"$f":"MID($B2,SEARCH(\"　\",$B2)+1,100)","v":"ジョウ"},{"$f":"CHOOSE(LEN(C2),C2&\"　　\",MID(C2,1,1)&\"　\"&MID(C2,2,1),C2)","v":{"$error":"#VALUE!"}},{"$f":"CHOOSE(LEN(D2),\"　　\"&D2,MID(D2,1,1)&\"　\"&MID(D2,2,1),D2)","v":"ジョウ"},{"$f":"PHONETIC(B2)","v":"もりおか　じょう"}]
[null,"サカリ　イチロウ",{"$f":"MID($B3,1,SEARCH(\"　\",$B3)-1)","v":"サカリ"},{"$f":"MID($B3,SEARCH(\"　\",$B3)+1,100)","v":"イチロウ"},{"$f":"CHOOSE(LEN(C3),C3&\"　　\",MID(C3,1,1)&\"　\"&MID(C3,2,1),C3)","v":"サカリ"},{"$f":"CHOOSE(LEN(D3),\"　　\"&D3,MID(D3,1,1)&\"　\"&MID(D3,2,1),D3)","v":{"$error":"#VALUE!"}},{"$f":"PHONETIC(B3)","v":"さかり　いちろう"}]
[null,null,{"$error":"#VALUE!"},{"$error":"#VALUE!"},{"$error":"#VALUE!"},{"$error":"#VALUE!"},""]
[null,null,{"$error":"#VALUE!"},{"$error":"#VALUE!"},{"$error":"#VALUE!"},{"$error":"#VALUE!"},{"$f":"PHONETIC(B5)","v":""}]
[null,null,{"$error":"#VALUE!"},{"$error":"#VALUE!"},{"$error":"#VALUE!"},{"$error":"#VALUE!"},""]
[null,null,{"$error":"#VALUE!"},{"$error":"#VALUE!"},{"$error":"#VALUE!"},{"$error":"#VALUE!"},""]
[null,null,{"$error":"#VALUE!"},{"$error":"#VALUE!"},{"$error":"#VALUE!"},{"$error":"#VALUE!"},""]
[null,null,{"$error":"#VALUE!"},{"$error":"#VALUE!"},{"$error":"#VALUE!"},{"$error":"#VALUE!"},""]
[null,null,{"$error":"#VALUE!"},{"$error":"#VALUE!"},{"$error":"#VALUE!"},{"$error":"#VALUE!"},""]
[null,null,{"$error":"#VALUE!"},{"$error":"#VALUE!"},{"$error":"#VALUE!"},{"$error":"#VALUE!"},""]
[null,null,{"$error":"#VALUE!"},{"$error":"#VALUE!"},{"$error":"#VALUE!"},{"$error":"#VALUE!"},""]
[null,null,{"$error":"#VALUE!"},{"$error":"#VALUE!"},{"$error":"#VALUE!"},{"$error":"#VALUE!"},""]
[null,null,{"$error":"#VALUE!"},{"$error":"#VALUE!"},{"$error":"#VALUE!"},{"$error":"#VALUE!"},""]
[null,null,{"$error":"#VALUE!"},{"$error":"#VALUE!"},{"$f":"CHOOSE(LEN(C15),C15&\"　　\",MID(C15,1,1)&\"　\"&MID(C15,2,1),C15)","v":{"$error":"#VALUE!"}},{"$error":"#VALUE!"},""]
[null,null,{"$error":"#VALUE!"},{"$error":"#VALUE!"},{"$error":"#VALUE!"},{"$error":"#VALUE!"},""]
[null,null,{"$error":"#VALUE!"},{"$error":"#VALUE!"},{"$error":"#VALUE!"},{"$error":"#VALUE!"},""]
[null,null,{"$error":"#VALUE!"},{"$error":"#VALUE!"},{"$error":"#VALUE!"},{"$error":"#VALUE!"},""]
[null,null,{"$error":"#VALUE!"},{"$error":"#VALUE!"},{"$error":"#VALUE!"},{"$error":"#VALUE!"},""]
[null,null,{"$error":"#VALUE!"},{"$error":"#VALUE!"},{"$error":"#VALUE!"},{"$error":"#VALUE!"},""]
{"$rows_left_out":130}